Target
Sigma non-opioid intracellular receptor 1
Ligand
BDBM50002280
Substrate
Meas. Tech.
ChEBML_201877
Ki
3±n/a nM
Citation
 Gilligan, PJCain, GAChristos, TECook, LDrummond, SJohnson, ALKergaye, AAMcElroy, JFRohrbach, KWSchmidt, WK Novel piperidine sigma receptor ligands as potential antipsychotic drugs. J Med Chem 35:4344-61 (1992)  
Target
Name:
Sigma non-opioid intracellular receptor 1
Synonyms:
Opioid receptor, sigma 1 SGMR1_MOUSE Sigma1-receptor Sigmar1
Type:
Enzyme Catalytic Domain
Mol. Mass.:
25246.51
Organism:
Mus musculus (Mouse)
Description:
O55242
Residue:
223
  
Inhibitor
Name:
BDBM50002280
Synonyms:
1-(1-Benzyl-piperidin-4-yl)-2-(4-fluoro-phenyl)-ethanone; compound with but-2-enedioic acid;0.75hydrate | CHEMBL442965
Type:
Small organic molecule
Emp. Form.:
C20H22FNO
Mol. Mass.:
311.3932
SMILES:
Fc1ccc(CC(=O)C2CCN(Cc3ccccc3)CC2)cc1
: