Target
Thromboxane-A synthase
Ligand
BDBM50003762
Substrate
Meas. Tech.
ChEBML_209943
IC50
200±n/a nM
Citation
 Main, AJGoldstein, RCohen, DSFurness, PLee, W Thromboxane receptor antagonism combined with thromboxane synthase inhibition. 2. Synthesis and biological activity of 8-(benzenesulfonamido)-7-(3-pyridinyl)octaonic acid and related compounds. J Med Chem 35:4362-5 (1992)  
Target
Name:
Thromboxane-A synthase
Synonyms:
CYP5 Cytochrome P450 5A1 TBXAS1 TXA synthase TXS Thromboxane A2 Synthase (P450 TxA2) Thromboxane prostanoid Thromboxane-A synthase
Type:
Enzyme
Mol. Mass.:
60524.67
Organism:
Homo sapiens (Human)
Description:
P24557
Residue:
533
  
Inhibitor
Name:
BDBM50003762
Synonyms:
7-Pyridin-3-yl-8-(toluene-2-sulfonylamino)-octanoic acid; hydrochloride | CHEMBL553313
Type:
Small organic molecule
Emp. Form.:
C20H26N2O4S
Mol. Mass.:
390.496
SMILES:
Cc1ccccc1S(=O)(=O)NCC(CCCCCC(O)=O)c1cccnc1
: