Target
Sterol O-acyltransferase 1
Ligand
BDBM50003816
Substrate
Meas. Tech.
ChEBML_28352
IC50
530±n/a nM
Citation
 Harris, NVSmith, CAshton, MJBridge, AWBush, RCCoffee, ECDron, DIHarper, MFLythgoe, DJNewton, CG Acyl-CoA:cholesterol O-acyl transferase (ACAT) inhibitors. 1. 2-(Alkylthio)-4,5-diphenyl-1H-imidazoles as potent inhibitors of ACAT. J Med Chem 35:4384-92 (1992)  
Target
Name:
Sterol O-acyltransferase 1
Synonyms:
ACAT-1 Acat SOAT1_RAT Sterol O-acyltransferase, Soat
Type:
PROTEIN
Mol. Mass.:
64165.56
Organism:
Rattus norvegicus
Description:
ChEMBL_28796
Residue:
545
  
Inhibitor
Name:
BDBM50003816
Synonyms:
2-([1,3]Dioxolan-2-ylmethylsulfanyl)-4,5-diphenyl-1H-imidazole | CHEMBL136675
Type:
Small organic molecule
Emp. Form.:
C19H18N2O2S
Mol. Mass.:
338.423
SMILES:
C(Sc1nc(c([nH]1)-c1ccccc1)-c1ccccc1)C1OCCO1
: