Target
Sterol O-acyltransferase 1
Ligand
BDBM50003821
Substrate
Meas. Tech.
ChEBML_28352
IC50
420±n/a nM
Citation
 Harris, NVSmith, CAshton, MJBridge, AWBush, RCCoffee, ECDron, DIHarper, MFLythgoe, DJNewton, CG Acyl-CoA:cholesterol O-acyl transferase (ACAT) inhibitors. 1. 2-(Alkylthio)-4,5-diphenyl-1H-imidazoles as potent inhibitors of ACAT. J Med Chem 35:4384-92 (1992)  
Target
Name:
Sterol O-acyltransferase 1
Synonyms:
ACAT-1 Acat SOAT1_RAT Sterol O-acyltransferase, Soat
Type:
PROTEIN
Mol. Mass.:
64165.56
Organism:
Rattus norvegicus
Description:
ChEMBL_28796
Residue:
545
  
Inhibitor
Name:
BDBM50003821
Synonyms:
6-[4,5-Bis-(4-methoxy-phenyl)-1H-imidazol-2-ylsulfanylmethyl]-4-hydroxy-4-methyl-tetrahydro-pyran-2-one | CHEMBL337377
Type:
Small organic molecule
Emp. Form.:
C24H26N2O5S
Mol. Mass.:
454.539
SMILES:
COc1ccc(cc1)-c1nc(SCC2C[C@](C)(O)CC(=O)O2)[nH]c1-c1ccc(OC)cc1
: