Target
Sterol O-acyltransferase 1
Ligand
BDBM50003831
Substrate
Meas. Tech.
ChEBML_28352
IC50
560±n/a nM
Citation
 Harris, NVSmith, CAshton, MJBridge, AWBush, RCCoffee, ECDron, DIHarper, MFLythgoe, DJNewton, CG Acyl-CoA:cholesterol O-acyl transferase (ACAT) inhibitors. 1. 2-(Alkylthio)-4,5-diphenyl-1H-imidazoles as potent inhibitors of ACAT. J Med Chem 35:4384-92 (1992)  
Target
Name:
Sterol O-acyltransferase 1
Synonyms:
ACAT-1 Acat SOAT1_RAT Sterol O-acyltransferase, Soat
Type:
PROTEIN
Mol. Mass.:
64165.56
Organism:
Rattus norvegicus
Description:
ChEMBL_28796
Residue:
545
  
Inhibitor
Name:
BDBM50003831
Synonyms:
4-(3-Chloro-phenyl)-5-phenyl-2-(tetrahydro-pyran-2-ylmethylsulfanyl)-1H-imidazole | CHEMBL139212
Type:
Small organic molecule
Emp. Form.:
C21H21ClN2OS
Mol. Mass.:
384.922
SMILES:
Clc1cccc(c1)-c1[nH]c(SCC2CCCCO2)nc1-c1ccccc1
: