Target
D(1A) dopamine receptor
Ligand
BDBM50002313
Substrate
Meas. Tech.
ChEBML_216117
IC50
11200±n/a nM
Citation
 Claudi, FGiorgioni, GDi Stefano, AAbbracchio, MPPaoletti, AMBalduini, W Synthesis and pharmacological characterization of 2-(4-chloro-3-hydroxyphenyl)ethylamine and N,N-dialkyl derivatives as dopamine receptor ligands. J Med Chem 35:4408-14 (1992)  
Target
Name:
D(1A) dopamine receptor
Synonyms:
DOPAMINE D1 Dopamine D1 high Dopamine receptor Dopamine1-like Drd1a
Type:
Enzyme Catalytic Domain
Mol. Mass.:
49429.75
Organism:
RAT
Description:
P18901
Residue:
446
  
Inhibitor
Name:
BDBM50002313
Synonyms:
2-Chloro-5-(2-{[2-(3-hydroxy-phenyl)-ethyl]-propyl-amino}-ethyl)-phenol; hydrobromide | CHEMBL541096
Type:
Small organic molecule
Emp. Form.:
C19H24ClNO2
Mol. Mass.:
333.852
SMILES:
CCCN(CCc1cccc(O)c1)CCc1ccc(Cl)c(O)c1
: