Target
Delta-type opioid receptor
Ligand
BDBM50455773
Substrate
Meas. Tech.
ChEBML_147017
Ki
0.660000±n/a nM
Citation
 Mosberg, HIKroona, HB Incorporation of a novel conformationally restricted tyrosine analog into a cyclic, delta opioid receptor selective tetrapeptide (JOM-13) enhances delta receptor binding affinity and selectivity. J Med Chem 35:4498-500 (1992)  
Target
Name:
Delta-type opioid receptor
Synonyms:
D-OR-1 Delta opioid receptor OPIATE Delta OPRD1 OPRK1 | opioid receptor, delta 1
Type:
G Protein-Coupled Receptor (GPCR)
Mol. Mass.:
40382.98
Organism:
Homo sapiens (Human)
Description:
Competition binding assays were carried out using membrane preparations from transfected HN9.10 cells that constitutively expressed the delta opioid receptor.
Residue:
372
  
Inhibitor
Name:
BDBM50455773
Synonyms:
CHEMBL2370868
Type:
Small organic molecule
Emp. Form.:
C28H34N4O6S2
Mol. Mass.:
586.723
SMILES:
[H][C@@]1(NCC[C@@H]1c1ccc(O)cc1)C(=O)N[C@@H]1CSSC(C)(C)[C@H](NC(=O)[C@H](Cc2ccccc2)NC1=O)C(O)=O
: