Target
Sigma non-opioid intracellular receptor 1
Ligand
BDBM50036736
Substrate
Meas. Tech.
ChEMBL_201133 (CHEMBL872418)
IC50
420±n/a nM
Citation
 Yevich, JPNew, JSLobeck, WGDextraze, PBernstein, ETaylor, DPYocca, FDEison, MSTemple, DL Synthesis and biological characterization of alpha-(4-fluorophenyl)-4-(5-fluoro-2-pyrimidinyl)-1-piperazinebutanol and analogues as potential atypical antipsychotic agents. J Med Chem 35:4516-25 (1993)  
Target
Name:
Sigma non-opioid intracellular receptor 1
Synonyms:
Aging-associated gene 8 protein SGMR1_HUMAN SIGMAR1 SR31747-binding protein Sigma 1-type opioid receptor Sigma1R | hSigmaR1
Type:
Enzyme Catalytic Domain
Mol. Mass.:
25124.85
Organism:
Homo sapiens (Human)
Description:
Q99720
Residue:
223
  
Inhibitor
Name:
BDBM50036736
Synonyms:
(S)-1-(4-Fluoro-phenyl)-4-[4-(5-fluoro-pyrimidin-2-yl)-piperazin-1-yl]-butan-1-ol | CHEMBL129263
Type:
Small organic molecule
Emp. Form.:
C18H22F2N4O
Mol. Mass.:
348.3903
SMILES:
O[C@@H](CCCN1CCN(CC1)c1ncc(F)cn1)c1ccc(F)cc1
: