Target
D(2) dopamine receptor
Ligand
BDBM50002326
Substrate
Meas. Tech.
ChEBML_61741
IC50
940±n/a nM
Citation
 Yevich, JPNew, JSLobeck, WGDextraze, PBernstein, ETaylor, DPYocca, FDEison, MSTemple, DL Synthesis and biological characterization of alpha-(4-fluorophenyl)-4-(5-fluoro-2-pyrimidinyl)-1-piperazinebutanol and analogues as potential atypical antipsychotic agents. J Med Chem 35:4516-25 (1993)  
Target
Name:
D(2) dopamine receptor
Synonyms:
DOPAMINE D2 DOPAMINE D2 Short Dopamine D2 receptor Drd2
Type:
G Protein-Coupled Receptor (GPCR)
Mol. Mass.:
50931.60
Organism:
Rattus norvegicus (rat)
Description:
P61169
Residue:
444
  
Inhibitor
Name:
BDBM50002326
Synonyms:
1,1-Bis-(4-fluoro-phenyl)-4-[4-(5-fluoro-pyrimidin-2-yl)-piperazin-1-yl]-butan-1-ol | CHEMBL138186
Type:
Small organic molecule
Emp. Form.:
C24H25F3N4O
Mol. Mass.:
442.4767
SMILES:
OC(CCCN1CCN(CC1)c1ncc(F)cn1)(c1ccc(F)cc1)c1ccc(F)cc1
: