Target
D(2) dopamine receptor
Ligand
BDBM50002325
Substrate
Meas. Tech.
ChEBML_61741
IC50
1700±n/a nM
Citation
 Yevich, JPNew, JSLobeck, WGDextraze, PBernstein, ETaylor, DPYocca, FDEison, MSTemple, DL Synthesis and biological characterization of alpha-(4-fluorophenyl)-4-(5-fluoro-2-pyrimidinyl)-1-piperazinebutanol and analogues as potential atypical antipsychotic agents. J Med Chem 35:4516-25 (1993)  
Target
Name:
D(2) dopamine receptor
Synonyms:
DOPAMINE D2 DOPAMINE D2 Short Dopamine D2 receptor Drd2
Type:
G Protein-Coupled Receptor (GPCR)
Mol. Mass.:
50931.60
Organism:
Rattus norvegicus (rat)
Description:
P61169
Residue:
444
  
Inhibitor
Name:
BDBM50002325
Synonyms:
2-{4-[3,4-Bis-(4-fluoro-phenyl)-but-3-enyl]-piperazin-1-yl}-pyrimidine | CHEMBL342484
Type:
Small organic molecule
Emp. Form.:
C24H24F2N4
Mol. Mass.:
406.471
SMILES:
Fc1ccc(\C=C(/CCN2CCN(CC2)c2ncccn2)c2ccc(F)cc2)cc1
: