Target
D(2) dopamine receptor
Ligand
BDBM50002334
Substrate
Meas. Tech.
ChEBML_61741
IC50
679±n/a nM
Citation
 Yevich, JPNew, JSLobeck, WGDextraze, PBernstein, ETaylor, DPYocca, FDEison, MSTemple, DL Synthesis and biological characterization of alpha-(4-fluorophenyl)-4-(5-fluoro-2-pyrimidinyl)-1-piperazinebutanol and analogues as potential atypical antipsychotic agents. J Med Chem 35:4516-25 (1993)  
Target
Name:
D(2) dopamine receptor
Synonyms:
DOPAMINE D2 DOPAMINE D2 Short Dopamine D2 receptor Drd2
Type:
G Protein-Coupled Receptor (GPCR)
Mol. Mass.:
50931.60
Organism:
Rattus norvegicus (rat)
Description:
P61169
Residue:
444
  
Inhibitor
Name:
BDBM50002334
Synonyms:
1-(4-Fluoro-phenyl)-4-(4-pyrimidin-2-yl-piperazin-1-yl)-butan-1-one CHEMBL140872
Type:
Small organic molecule
Emp. Form.:
C18H21FN4O
Mol. Mass.:
328.3839
SMILES:
Fc1ccc(cc1)C(=O)CCCN1CCN(CC1)c1ncccn1
: