Target
D(2) dopamine receptor
Ligand
BDBM50002339
Substrate
Meas. Tech.
ChEBML_61741
IC50
494±n/a nM
Citation
 Yevich, JPNew, JSLobeck, WGDextraze, PBernstein, ETaylor, DPYocca, FDEison, MSTemple, DL Synthesis and biological characterization of alpha-(4-fluorophenyl)-4-(5-fluoro-2-pyrimidinyl)-1-piperazinebutanol and analogues as potential atypical antipsychotic agents. J Med Chem 35:4516-25 (1993)  
Target
Name:
D(2) dopamine receptor
Synonyms:
DOPAMINE D2 DOPAMINE D2 Short Dopamine D2 receptor Drd2
Type:
G Protein-Coupled Receptor (GPCR)
Mol. Mass.:
50931.60
Organism:
Rattus norvegicus (rat)
Description:
P61169
Residue:
444
  
Inhibitor
Name:
BDBM50002339
Synonyms:
1-(4-Fluoro-phenyl)-4-[4-(5-fluoro-pyrimidin-2-yl)-piperazin-1-yl]-butan-1-one | CHEMBL140656
Type:
Small organic molecule
Emp. Form.:
C18H20F2N4O
Mol. Mass.:
346.3744
SMILES:
Fc1ccc(cc1)C(=O)CCCN1CCN(CC1)c1ncc(F)cn1
: