Target
D(2) dopamine receptor
Ligand
BDBM50002322
Substrate
Meas. Tech.
ChEBML_61741
IC50
>1000±n/a nM
Citation
 Yevich, JPNew, JSLobeck, WGDextraze, PBernstein, ETaylor, DPYocca, FDEison, MSTemple, DL Synthesis and biological characterization of alpha-(4-fluorophenyl)-4-(5-fluoro-2-pyrimidinyl)-1-piperazinebutanol and analogues as potential atypical antipsychotic agents. J Med Chem 35:4516-25 (1993)  
Target
Name:
D(2) dopamine receptor
Synonyms:
DOPAMINE D2 DOPAMINE D2 Short Dopamine D2 receptor Drd2
Type:
G Protein-Coupled Receptor (GPCR)
Mol. Mass.:
50931.60
Organism:
Rattus norvegicus (rat)
Description:
P61169
Residue:
444
  
Inhibitor
Name:
BDBM50002322
Synonyms:
4-[4-(5-Fluoro-4-methylsulfanyl-pyrimidin-2-yl)-piperazin-1-yl]-1-(4-fluoro-phenyl)-butan-1-ol | CHEMBL140650
Type:
Small organic molecule
Emp. Form.:
C19H24F2N4OS
Mol. Mass.:
394.482
SMILES:
CSc1nc(ncc1F)N1CCN(CCCC(O)c2ccc(F)cc2)CC1
: