Target
Mu-type opioid receptor
Ligand
BDBM50001716
Substrate
Meas. Tech.
ChEBML_146240
IC50
2.8±n/a nM
Citation
 Klein, PNelson, WL O3-(2-carbomethoxyallyl) ethers of opioid ligands derived from oxymorphone, naltrexone, etorphine, diprenorphine, norbinaltorphimine, and naltrindole. Unexpected O3-dealkylation in the opioid radioligand displacement assay. J Med Chem 35:4589-94 (1993)  
Target
Name:
Mu-type opioid receptor
Synonyms:
M-OR-1 Mu opioid receptor OPIATE Mu OPRM_CAVPO
Type:
Enzyme Catalytic Domain
Mol. Mass.:
11165.58
Organism:
GUINEA PIG
Description:
P97266
Residue:
98
  
Inhibitor
Name:
BDBM50001716
Synonyms:
CHEMBL140044 | methyl 2-[4-cyclopropylmethyl-14,17-dihydroxy-12-oxa-4-azapentacyclo[9.6.1.01,13.05,17.07,18]octadeca-7,9,11(18)-trien-10-yloxymethyl]acrylate
Type:
Small organic molecule
Emp. Form.:
C25H31NO6
Mol. Mass.:
441.5167
SMILES:
COC(=O)C(=C)COc1ccc2C[C@H]3N(CC4CC4)CC[C@@]45[C@@H](Oc1c24)[C@H](O)CC[C@@]35O
: