Target
Kappa-type opioid receptor
Ligand
BDBM50001707
Substrate
Meas. Tech.
ChEBML_145206
IC50
630±n/a nM
Citation
 Klein, PNelson, WL O3-(2-carbomethoxyallyl) ethers of opioid ligands derived from oxymorphone, naltrexone, etorphine, diprenorphine, norbinaltorphimine, and naltrindole. Unexpected O3-dealkylation in the opioid radioligand displacement assay. J Med Chem 35:4589-94 (1993)  
Target
Name:
Kappa-type opioid receptor
Synonyms:
Kappa Opioid Receptor OPRK1 Opiate Kappa 1 | mu/kappa opioid receptor
Type:
G Protein-Coupled Receptor (GPCR)
Mol. Mass.:
42744.99
Organism:
Cavia porcellus (domestic guinea pig)
Description:
P41144
Residue:
380
  
Inhibitor
Name:
BDBM50001707
Synonyms:
10,17-dihydroxy-4-methyl-(13R,17S)-12-oxa-4-azapentacyclo[9.6.1.01,13.05,17.07,18]octadeca-7(18),8,10-trien-14-one 10,17-dihydroxy-4-methyl-(13R,17S)-12-oxa-4-azapentacyclo[9.6.1.01,13.05,17.07,18]octadeca-7(18),8,10-trien-14-one(xymorphone) CHEMBL963 Combunox OXYMORPHONE Oxycet Percocet Roxicet Roxiprin Tylox-325
Type:
Small organic molecule
Emp. Form.:
C17H19NO4
Mol. Mass.:
301.3371
SMILES:
CN1CC[C@@]23[C@H]4Oc5c2c(C[C@@H]1[C@]3(O)CCC4=O)ccc5O
: