Target
Mu-type opioid receptor
Ligand
BDBM50002349
Substrate
Meas. Tech.
ChEBML_146266
Ki
32±n/a nM
Citation
 Choi, HMurray, TFDeLander, GECaldwell, VAldrich, JV N-terminal alkylated derivatives of [D-Pro10]dynorphin A-(1-11) are highly selective for kappa-opioid receptors. J Med Chem 35:4638-9 (1993)  
Target
Name:
Mu-type opioid receptor
Synonyms:
M-OR-1 Mu opioid receptor OPIATE Mu OPRM_CAVPO
Type:
Enzyme Catalytic Domain
Mol. Mass.:
11165.58
Organism:
GUINEA PIG
Description:
P97266
Residue:
98
  
Inhibitor
Name:
BDBM50002349
Synonyms:
CHEMBL413160 | [N,N-diallylTyr1, D-pro10]Dynorphin A(1-11)
Type:
Small organic molecule
Emp. Form.:
C69H111N21O13
Mol. Mass.:
1442.7525
SMILES:
CC[C@H](C)[C@H](NC(=O)[C@H](CCCNC(N)=N)NC(=O)[C@H](CCCNC(N)=N)NC(=O)[C@H](CC(C)C)NC(=O)[C@H](Cc1ccccc1)NC(=O)CNC(=O)CNC(=O)[C@H](Cc1ccc(O)cc1)N(CC=C)CC=C)C(=O)N[C@@H](CCCNC(N)=N)C(=O)N1CCC[C@@H]1C(=O)N[C@@H](CCCCN)C(O)=O
: