Target
Type-1 angiotensin II receptor B
Ligand
BDBM50004154
Substrate
Meas. Tech.
ChEBML_217980
Ki
1±n/a nM
Citation
 Atwal, KSAhmed, SZBird, JEDelaney, CLDickinson, KEFerrara, FNHedberg, AMiller, AVMoreland, SO'Reilly, BC Dihydropyrimidine angiotensin II receptor antagonists. J Med Chem 35:4751-63 (1993)  
Target
Name:
Type-1 angiotensin II receptor B
Synonyms:
AGTRB_RAT Agtr1 Angiotensin II AT1B Angiotensin II type 1b (AT-1b) receptor Type-1B angiotensin II receptor
Type:
Enzyme Catalytic Domain
Mol. Mass.:
40929.44
Organism:
RAT
Description:
Angiotensin II AT1B 0 RAT::P29089
Residue:
359
  
Inhibitor
Name:
BDBM50004154
Synonyms:
2-Butyl-4-chloro-6-methyl-1-[2'-(1H-tetrazol-5-yl)-biphenyl-4-ylmethyl]-1,6-dihydro-pyrimidine-5-carboxylic acid | CHEMBL358335
Type:
Small organic molecule
Emp. Form.:
C24H25ClN6O2
Mol. Mass.:
464.947
SMILES:
CCCCC1=NC(Cl)=C(C(C)N1Cc1ccc(cc1)-c1ccccc1-c1nnn[nH]1)C(O)=O
: