Target
Type-1 angiotensin II receptor B
Ligand
BDBM50004165
Substrate
Meas. Tech.
ChEBML_217980
Ki
1600±n/a nM
Citation
 Atwal, KSAhmed, SZBird, JEDelaney, CLDickinson, KEFerrara, FNHedberg, AMiller, AVMoreland, SO'Reilly, BC Dihydropyrimidine angiotensin II receptor antagonists. J Med Chem 35:4751-63 (1993)  
Target
Name:
Type-1 angiotensin II receptor B
Synonyms:
AGTRB_RAT Agtr1 Angiotensin II AT1B Angiotensin II type 1b (AT-1b) receptor Type-1B angiotensin II receptor
Type:
Enzyme Catalytic Domain
Mol. Mass.:
40929.44
Organism:
RAT
Description:
Angiotensin II AT1B 0 RAT::P29089
Residue:
359
  
Inhibitor
Name:
BDBM50004165
Synonyms:
CHEMBL144952 | Sodium; 4'-(2-butyl-5-ethoxycarbonyl-6-oxo-4-phenyl-6H-pyrimidin-1-ylmethyl)-biphenyl-2-carboxylate
Type:
Small organic molecule
Emp. Form.:
C31H29N2O5
Mol. Mass.:
509.5729
SMILES:
CCCCc1nc(-c2ccccc2)c(C(=O)OCC)c(=O)n1Cc1ccc(cc1)-c1ccccc1C([O-])=O
: