Target
Reverse transcriptase/RNaseH
Ligand
BDBM50368501
Substrate
Meas. Tech.
ChEMBL_196935 (CHEMBL803952)
IC50
214000±n/a nM
Citation
 Tan, GTWickramasinghe, ABaba, MHughes, SHMohan, PPezzuto, JMSingh, RVerma, S Potential anti-AIDS naphthalenesulfonic acid derivatives. Synthesis and inhibition of HIV-1 induced cytopathogenesis and HIV-1 and HIV-2 reverse transcriptase activities. J Med Chem 35:4846-53 (1992)  
Target
Name:
Reverse transcriptase/RNaseH
Synonyms:
HIV-1 Reverse Transcriptase RNase H Reverse transcriptase/RNaseH
Type:
PROTEIN
Mol. Mass.:
65229.15
Organism:
Human immunodeficiency virus 1
Description:
ChEMBL_1473730
Residue:
566
  
Inhibitor
Name:
BDBM50368501
Synonyms:
CHEMBL1744155
Type:
Small organic molecule
Emp. Form.:
C32H30N2O20S6
Mol. Mass.:
954.975
SMILES:
[O-]S(=O)(=O)c1cc(NC(=O)CCCCCCCCCCC(=O)Nc2cc(cc3cc(cc(c23)S([O-])(=O)=O)S([O-])(=O)=O)S([O-])(=O)=O)c2c(cc(cc2c1)S([O-])(=O)=O)S([O-])(=O)=O
: