Target
Reverse transcriptase/RNaseH
Ligand
BDBM50000039
Substrate
Meas. Tech.
ChEBML_196935
IC50
50000±n/a nM
Citation
 Tan, GTWickramasinghe, ABaba, MHughes, SHMohan, PPezzuto, JMSingh, RVerma, S Potential anti-AIDS naphthalenesulfonic acid derivatives. Synthesis and inhibition of HIV-1 induced cytopathogenesis and HIV-1 and HIV-2 reverse transcriptase activities. J Med Chem 35:4846-53 (1992)  
Target
Name:
Reverse transcriptase/RNaseH
Synonyms:
HIV-1 Reverse Transcriptase RNase H Reverse transcriptase/RNaseH
Type:
PROTEIN
Mol. Mass.:
65229.15
Organism:
Human immunodeficiency virus 1
Description:
ChEMBL_1473730
Residue:
566
  
Inhibitor
Name:
BDBM50000039
Synonyms:
3,4-Diamino-naphthalene-1-sulfonic acid | CHEMBL444789
Type:
Small organic molecule
Emp. Form.:
C10H10N2O3S
Mol. Mass.:
238.263
SMILES:
Nc1cc(c2ccccc2c1N)S(O)(=O)=O
: