Target
Reverse transcriptase/RNaseH
Ligand
BDBM50368496
Substrate
Meas. Tech.
ChEMBL_196935 (CHEMBL803952)
IC50
>1000000±n/a nM
Citation
 Tan, GTWickramasinghe, ABaba, MHughes, SHMohan, PPezzuto, JMSingh, RVerma, S Potential anti-AIDS naphthalenesulfonic acid derivatives. Synthesis and inhibition of HIV-1 induced cytopathogenesis and HIV-1 and HIV-2 reverse transcriptase activities. J Med Chem 35:4846-53 (1992)  
Target
Name:
Reverse transcriptase/RNaseH
Synonyms:
HIV-1 Reverse Transcriptase RNase H Reverse transcriptase/RNaseH
Type:
PROTEIN
Mol. Mass.:
65229.15
Organism:
Human immunodeficiency virus 1
Description:
ChEMBL_1473730
Residue:
566
  
Inhibitor
Name:
BDBM50368496
Synonyms:
CHEMBL1744152
Type:
Small organic molecule
Emp. Form.:
C13H13NO7S2
Mol. Mass.:
359.376
SMILES:
COc1cc(cc2cc(cc(N(C)C)c12)S([O-])(=O)=O)S([O-])(=O)=O
: