Target
ATP-citrate synthase
Ligand
BDBM50368516
Substrate
Meas. Tech.
ChEBML_29531
Ki
250000±n/a nM
Citation
 McNair, DHughes, MJEggelston, D ATP-citrate lyase as a target for hypolipidemic intervention. Sulfoximine and 3-hydroxy-beta-lactam containing analogues of citric acid as potential tight-binding inhibitors. J Med Chem 35:4875-84 (1992)  
Target
Name:
ATP-citrate synthase
Synonyms:
ACLY_RAT | Acly
Type:
PROTEIN
Mol. Mass.:
120645.65
Organism:
Rattus norvegicus
Description:
ChEMBL_857791
Residue:
1100
  
Inhibitor
Name:
BDBM50368516
Synonyms:
CHEMBL1627232
Type:
Small organic molecule
Emp. Form.:
C6H11NO6S
Mol. Mass.:
225.22
SMILES:
CS(N)(=O)=C[C@@](O)(CC(O)=O)C(O)=O
: