Target
5-hydroxytryptamine receptor 3A/3B
Ligand
BDBM50004273
Substrate
Meas. Tech.
ChEMBL_2990 (CHEMBL619781)
Ki
1.1±n/a nM
Citation
 Hayashi, HIchikawa, SKono, MMiwa, YSuzuki, FYoda, N 5-HT3 receptor antagonists. 1. New quinoline derivatives. J Med Chem 35:4893-902 (1992)  
Target
Name:
5-hydroxytryptamine receptor 3A/3B
Synonyms:
Serotonin 3 (5-HT3) receptor | Serotonin 3a (5-HT3a)/3b (5-HT3b) receptor
Type:
Mol. Mass.:
Description:
ASSAY_ID of EBI is 2974
Components:
This complex has 2 components.
Component 1
Name:
5-hydroxytryptamine receptor 3B
Synonyms:
5HT3B_RAT Serotonin (5-HT) receptor
Type:
PROTEIN
Mol. Mass.:
50328.78
Organism:
Rattus norvegicus
Description:
EBI_11885
Residue:
437
  
Component 2
Name:
5-hydroxytryptamine receptor 3A
Synonyms:
5-HT3 5HT3A_RAT Htr3 Serotonin (5-HT) receptor | Zacopride site-R
Type:
Enzyme Catalytic Domain
Mol. Mass.:
55428.70
Organism:
RAT
Description:
5-HT3 HTR3A RAT::P35563
Residue:
483
  
Inhibitor
Name:
BDBM50004273
Synonyms:
1-Ethyl-2-oxo-1,2-dihydro-quinoline-4-carboxylic acid 8-methyl-8-aza-bicyclo[3.2.1]oct-3-yl ester | CHEMBL322751
Type:
Small organic molecule
Emp. Form.:
C20H24N2O3
Mol. Mass.:
340.4162
SMILES:
CCn1c2ccccc2c(cc1=O)C(=O)OC1CC2CCC(C1)N2C
: