Target
Integrin alpha-IIb/beta-3
Ligand
BDBM50003851
Substrate
Meas. Tech.
ChEMBL_158206 (CHEMBL763555)
IC50
40000±n/a nM
Citation
 Zablocki, JAMiyano, MRao, SNPanzer-Knodle, SNicholson, NFeigen, L Potent inhibitors of platelet aggregation based upon the Arg-Gly-Asp-Phe sequence of fibrinogen. A proposal on the nature of the binding interaction between the Asp-carboxylate of RGDX mimetics and the platelet GP IIb-IIIa receptor. J Med Chem 35:4914-7 (1993)  
Target
Name:
Integrin alpha-IIb/beta-3
Synonyms:
Glycoprotein IIb/IIIa
Type:
Mol. Mass.:
Description:
ASSAY_ID of EBI is 30109
Components:
This complex has 2 components.
Component 1
Name:
Integrin beta-3
Synonyms:
CD_antigen=CD61 GPIIIa ITGB3 Platelet membrane glycoprotein IIIa
Type:
Protein
Mol. Mass.:
87038.91
Organism:
Homo sapiens (Human)
Description:
P05106
Residue:
788
  
Component 2
Name:
Integrin alpha-IIb
Synonyms:
CD_antigen=CD41 GPIIb Glycoprotein IIb ITGA2B Integrin alpha-IIb heavy chain Integrin alpha-IIb light chain, form 2 Integrin alpha-V/beta-3 and alpha-IIb/beta 3 | Platelet membrane glycoprotein IIb
Type:
Protein
Mol. Mass.:
113354.85
Organism:
Homo sapiens (Human)
Description:
P08514
Residue:
1039
  
Inhibitor
Name:
BDBM50003851
Synonyms:
(6S,12S,15S)-1,6-diamino-15-benzyl-12-(carboxymethyl)-1-imino-7,10,13-trioxo-2,8,11,14-tetraazahexadecan-16-oic acid 1-({[2-Carboxy-1-(1-carboxy-2-phenyl-ethylcarbamoyl)-ethylcarbamoyl]-methyl}-carbamoyl)-4-(diaminomethyl-amino)-butyl-ammonium(Arg-Gly-Asp-Phe) CHEMBL303561
Type:
Small organic molecule
Emp. Form.:
C21H31N7O7
Mol. Mass.:
493.5135
SMILES:
[#7]-[#6@@H](-[#6]-[#6]-[#6]\[#7]=[#6](/[#7])-[#7])-[#6](=O)-[#7]-[#6]-[#6](=O)-[#7]-[#6@@H](-[#6]-[#6](-[#8])=O)-[#6](=O)-[#7]-[#6@@H](-[#6]-c1ccccc1)-[#6](-[#8])=O
: