Target
Integrin alpha-IIb/beta-3
Ligand
BDBM50004338
Substrate
Meas. Tech.
ChEMBL_70338 (CHEMBL676999)
IC50
600±n/a nM
Citation
 Zablocki, JAMiyano, MRao, SNPanzer-Knodle, SNicholson, NFeigen, L Potent inhibitors of platelet aggregation based upon the Arg-Gly-Asp-Phe sequence of fibrinogen. A proposal on the nature of the binding interaction between the Asp-carboxylate of RGDX mimetics and the platelet GP IIb-IIIa receptor. J Med Chem 35:4914-7 (1993)  
Target
Name:
Integrin alpha-IIb/beta-3
Synonyms:
Glycoprotein IIb/IIIa
Type:
Mol. Mass.:
Description:
ASSAY_ID of EBI is 30109
Components:
This complex has 2 components.
Component 1
Name:
Integrin beta-3
Synonyms:
CD_antigen=CD61 GPIIIa ITGB3 Platelet membrane glycoprotein IIIa
Type:
Protein
Mol. Mass.:
87038.91
Organism:
Homo sapiens (Human)
Description:
P05106
Residue:
788
  
Component 2
Name:
Integrin alpha-IIb
Synonyms:
CD_antigen=CD41 GPIIb Glycoprotein IIb ITGA2B Integrin alpha-IIb heavy chain Integrin alpha-IIb light chain, form 2 Integrin alpha-V/beta-3 and alpha-IIb/beta 3 | Platelet membrane glycoprotein IIb
Type:
Protein
Mol. Mass.:
113354.85
Organism:
Homo sapiens (Human)
Description:
P08514
Residue:
1039
  
Inhibitor
Name:
BDBM50004338
Synonyms:
N-(1-Carboxy-2-phenyl-ethyl)-3-[8-(diaminomethyl-amino)-octanoylamino]-succinamic acid
Type:
Small organic molecule
Emp. Form.:
C22H32N5O6
Mol. Mass.:
462.5199
SMILES:
NC(=[NH2+])NCCCCCCCC(=O)N[C@@H](CC([O-])=O)C(=O)N[C@@H](Cc1ccccc1)C([O-])=O
: