Target
Adenosine receptor A1
Ligand
BDBM50452520
Substrate
Meas. Tech.
ChEBML_29305
Ki
142±n/a nM
Citation
 Jacobson, KAvan Galen, PJWilliams, M Adenosine receptors: pharmacology, structure-activity relationships, and therapeutic potential. J Med Chem 35:407-22 (1992)  
Target
Name:
Adenosine receptor A1
Synonyms:
AA1R_RAT ADENOSINE A1 high Adenosine A1 receptor (A1) Adenosine receptors A1 | Adora1
Type:
Protein
Mol. Mass.:
36704.13
Organism:
Rattus norvegicus (rat)
Description:
Residue:
326
  
Inhibitor
Name:
BDBM50452520
Synonyms:
CHEMBL2094089 | N6-[2-(3,5-dimethoxyphenyl)-2-(2-methylpheny1)ethyl]adenosine (3, DPMA)
Type:
Small organic molecule
Emp. Form.:
C27H31N5O6
Mol. Mass.:
521.5649
SMILES:
COc1cc(OC)cc(c1)C(CNc1ncnc2n(cnc12)[C@@H]1O[C@H](CO)[C@@H](O)[C@H]1O)c1ccccc1C
: