Target
Adenosine receptor A1
Ligand
BDBM50009509
Substrate
Meas. Tech.
ChEBML_29305
Ki
12000±n/a nM
Citation
 Jacobson, KAvan Galen, PJWilliams, M Adenosine receptors: pharmacology, structure-activity relationships, and therapeutic potential. J Med Chem 35:407-22 (1992)  
Target
Name:
Adenosine receptor A1
Synonyms:
AA1R_RAT ADENOSINE A1 high Adenosine A1 receptor (A1) Adenosine receptors A1 | Adora1
Type:
Protein
Mol. Mass.:
36704.13
Organism:
Rattus norvegicus (rat)
Description:
Residue:
326
  
Inhibitor
Name:
BDBM50009509
Synonyms:
(CGS 22,492) 2-[6-Amino-2-(2-cyclohexyl-ethylamino)-purin-9-yl]-5-hydroxymethyl-tetrahydro-furan-3,4-diol CHEMBL87459
Type:
Small organic molecule
Emp. Form.:
C18H28N6O4
Mol. Mass.:
392.4527
SMILES:
Nc1nc(NCCC2CCCCC2)nc2n(cnc12)C1O[C@H](CO)[C@@H](O)[C@H]1O
: