Target
Adenosine receptor A1
Ligand
BDBM50008416
Substrate
Meas. Tech.
ChEMBL_29307 (CHEMBL640368)
Ki
2±n/a nM
Citation
 Jacobson, KAvan Galen, PJWilliams, M Adenosine receptors: pharmacology, structure-activity relationships, and therapeutic potential. J Med Chem 35:407-22 (1992)  
Target
Name:
Adenosine receptor A1
Synonyms:
AA1R_RAT ADENOSINE A1 high Adenosine A1 receptor (A1) Adenosine receptors A1 | Adora1
Type:
Protein
Mol. Mass.:
36704.13
Organism:
Rattus norvegicus (rat)
Description:
Residue:
326
  
Inhibitor
Name:
BDBM50008416
Synonyms:
8-Cyclohexyl-1,3,7-trimethyl-3,7-dihydro-purine-2,6-dione | CHEMBL281811
Type:
Small organic molecule
Emp. Form.:
C14H20N4O2
Mol. Mass.:
276.3342
SMILES:
Cn1c(nc2n(C)c(=O)n(C)c(=O)c12)C1CCCCC1
: