Target
Adenosine receptor A1
Ligand
BDBM50368546
Substrate
Meas. Tech.
ChEMBL_29305 (CHEMBL640366)
Ki
4.1±n/a nM
Citation
 Jacobson, KAvan Galen, PJWilliams, M Adenosine receptors: pharmacology, structure-activity relationships, and therapeutic potential. J Med Chem 35:407-22 (1992)  
Target
Name:
Adenosine receptor A1
Synonyms:
AA1R_RAT ADENOSINE A1 high Adenosine A1 receptor (A1) Adenosine receptors A1 | Adora1
Type:
Protein
Mol. Mass.:
36704.13
Organism:
Rattus norvegicus (rat)
Description:
Residue:
326
  
Inhibitor
Name:
BDBM50368546
Synonyms:
CHEMBL1257013 | N6-2-Phenylethyladenosine
Type:
Small organic molecule
Emp. Form.:
C18H21N5O4
Mol. Mass.:
371.3904
SMILES:
OC[C@H]1O[C@H]([C@H](O)[C@@H]1O)n1cnc2c(NCCc3ccccc3)ncnc12
: