Target
5-hydroxytryptamine receptor 1A
Ligand
BDBM79181
Substrate
Meas. Tech.
ChEBML_1463
Ki
411±n/a nM
Citation
 Scott, MKMartin, GEDiStefano, DLFedde, CLKukla, MJBarrett, DLBaldy, WJElgin, RJKesslick, JMMathiasen, JR Pyrrole mannich bases as potential antipsychotic agents. J Med Chem 35:552-8 (1992)  
Target
Name:
5-hydroxytryptamine receptor 1A
Synonyms:
5-HT-1A 5-HT1A 5-hydroxytryptamine receptor 1A (5HT1A) 5ht1a Htr1a Serotonin 1a (5-HT1a) receptor/Adrenergic receptor alpha-1 | Serotonin receptor 1A
Type:
G Protein-Coupled Receptor (GPCR)
Mol. Mass.:
46445.29
Organism:
Rattus norvegicus (rat)
Description:
Binding assays were performed using rat hippocampal membranes.
Residue:
422
  
Inhibitor
Name:
BDBM79181
Synonyms:
10-[3-(4-methyl-1-piperazinyl)propyl]-2-(trifluoromethyl)phenothiazine;hydrochloride 10-[3-(4-methylpiperazino)propyl]-2-(trifluoromethyl)phenothiazine;hydrochloride SMR000059133 TRIFLUOPERAZINE DIHYDROCHLORIDE US11542290, Compound Trifluoperazine cid_5566
Type:
Small organic molecule
Emp. Form.:
C21H24F3N3S
Mol. Mass.:
407.496
SMILES:
CN1CCN(CCCN2c3ccccc3Sc3ccc(cc23)C(F)(F)F)CC1
: