Target
D(2) dopamine receptor
Ligand
BDBM50001862
Substrate
Meas. Tech.
ChEMBL_63061 (CHEMBL673628)
Ki
>1000±n/a nM
Citation
 Scott, MKMartin, GEDiStefano, DLFedde, CLKukla, MJBarrett, DLBaldy, WJElgin, RJKesslick, JMMathiasen, JR Pyrrole mannich bases as potential antipsychotic agents. J Med Chem 35:552-8 (1992)  
Target
Name:
D(2) dopamine receptor
Synonyms:
DOPAMINE D2 DOPAMINE D2 Short Dopamine D2 receptor Drd2
Type:
G Protein-Coupled Receptor (GPCR)
Mol. Mass.:
50931.60
Organism:
Rattus norvegicus (rat)
Description:
P61169
Residue:
444
  
Inhibitor
Name:
BDBM50001862
Synonyms:
(N-(o-methoxyphenyl)piperazine)1-(2-Methoxy-phenyl)-piperazine 2-METHOXYPHENYLPIPERAZINE CHEMBL9666 | EN300-33366
Type:
Small organic molecule
Emp. Form.:
C11H16N2O
Mol. Mass.:
192.2575
SMILES:
COc1ccccc1N1CCNCC1
: