Target
D(2) dopamine receptor
Ligand
BDBM50001854
Substrate
Meas. Tech.
ChEMBL_63061 (CHEMBL673628)
Ki
>100±n/a nM
Citation
 Scott, MKMartin, GEDiStefano, DLFedde, CLKukla, MJBarrett, DLBaldy, WJElgin, RJKesslick, JMMathiasen, JR Pyrrole mannich bases as potential antipsychotic agents. J Med Chem 35:552-8 (1992)  
Target
Name:
D(2) dopamine receptor
Synonyms:
DOPAMINE D2 DOPAMINE D2 Short Dopamine D2 receptor Drd2
Type:
G Protein-Coupled Receptor (GPCR)
Mol. Mass.:
50931.60
Organism:
Rattus norvegicus (rat)
Description:
P61169
Residue:
444
  
Inhibitor
Name:
BDBM50001854
Synonyms:
1-{1-Methyl-5-[4-(3-nitro-phenyl)-piperazin-1-ylmethyl]-1H-pyrrol-2-ylmethyl}-pyrrolidin-2-one | CHEMBL153263
Type:
Small organic molecule
Emp. Form.:
C21H27N5O3
Mol. Mass.:
397.4708
SMILES:
Cn1c(CN2CCCC2=O)ccc1CN1CCN(CC1)c1cccc(c1)[N+]([O-])=O
: