Target
Neutrophil elastase
Ligand
BDBM50005152
Substrate
Meas. Tech.
ChEMBL_63659 (CHEMBL878146)
IC50
73±n/a nM
Citation
 Skiles, JWFuchs, VMiao, CSorcek, RGrozinger, KGMauldin, SCVitous, JMui, PWJacober, SChow, G Inhibition of human leukocyte elastase (HLE) by N-substituted peptidyl trifluoromethyl ketones. J Med Chem 35:641-62 (1992)  
Target
Name:
Neutrophil elastase
Synonyms:
Bone marrow serine protease Coagulation factor X ELANE Elastase HLE Leukocyte elastase Medullasin Neutrophil elastase (HNE) PMN elastase Trypsin
Type:
Enzyme
Mol. Mass.:
28532.38
Organism:
Homo sapiens (Human)
Description:
P08246
Residue:
267
  
Inhibitor
Name:
BDBM50005152
Synonyms:
CHEMBL160365 | {2-Methyl-1-[3-(3,3,3-trifluoro-1-isopropyl-2-oxo-propylcarbamoyl)-3,4-dihydro-1H-isoquinoline-2-carbonyl]-propyl}-carbamic acid benzyl ester
Type:
Small organic molecule
Emp. Form.:
C29H34F3N3O5
Mol. Mass.:
561.5926
SMILES:
CC(C)C(NC(=O)OCc1ccccc1)C(=O)N1Cc2ccccc2CC1C(=O)NC(C(C)C)C(=O)C(F)(F)F
: