Target
Neutrophil elastase
Ligand
BDBM50005146
Substrate
Meas. Tech.
ChEBML_63659
IC50
1562±n/a nM
Citation
 Skiles, JWFuchs, VMiao, CSorcek, RGrozinger, KGMauldin, SCVitous, JMui, PWJacober, SChow, G Inhibition of human leukocyte elastase (HLE) by N-substituted peptidyl trifluoromethyl ketones. J Med Chem 35:641-62 (1992)  
Target
Name:
Neutrophil elastase
Synonyms:
Bone marrow serine protease Coagulation factor X ELANE Elastase HLE Leukocyte elastase Medullasin Neutrophil elastase (HNE) PMN elastase Trypsin
Type:
Enzyme
Mol. Mass.:
28532.38
Organism:
Homo sapiens (Human)
Description:
P08246
Residue:
267
  
Inhibitor
Name:
BDBM50005146
Synonyms:
(1-{Indan-2-yl-[(3,3,3-trifluoro-1-isopropyl-2-oxo-propylcarbamoyl)-methyl]-carbamoyl}-2-methyl-propyl)-methyl-carbamic acid benzyl ester | CHEMBL160206
Type:
Small organic molecule
Emp. Form.:
C31H38F3N3O5
Mol. Mass.:
589.6457
SMILES:
CC(C)C(NC(=O)CN(C1Cc2ccccc2C1)C(=O)C(C(C)C)N(C)C(=O)OCc1ccccc1)C(=O)C(F)(F)F
: