Target
Neutrophil elastase
Ligand
BDBM50005149
Substrate
Meas. Tech.
ChEBML_63659
IC50
110±n/a nM
Citation
 Skiles, JWFuchs, VMiao, CSorcek, RGrozinger, KGMauldin, SCVitous, JMui, PWJacober, SChow, G Inhibition of human leukocyte elastase (HLE) by N-substituted peptidyl trifluoromethyl ketones. J Med Chem 35:641-62 (1992)  
Target
Name:
Neutrophil elastase
Synonyms:
Bone marrow serine protease Coagulation factor X ELANE Elastase HLE Leukocyte elastase Medullasin Neutrophil elastase (HNE) PMN elastase Trypsin
Type:
Enzyme
Mol. Mass.:
28532.38
Organism:
Homo sapiens (Human)
Description:
P08246
Residue:
267
  
Inhibitor
Name:
BDBM50005149
Synonyms:
2-{2-[4-(4-Chloro-benzenesulfonylaminocarbonyl)-benzoylamino]-3-methyl-butyryl}-1,2,3,4-tetrahydro-isoquinoline-3-carboxylic acid (3,3,3-trifluoro-1-isopropyl-2-oxo-propyl)-amide | CHEMBL158216
Type:
Small organic molecule
Emp. Form.:
C35H36ClF3N4O7S
Mol. Mass.:
749.196
SMILES:
CC(C)C(NC(=O)c1ccc(cc1)C(=O)NS(=O)(=O)c1ccc(Cl)cc1)C(=O)N1Cc2ccccc2CC1C(=O)NC(C(C)C)C(=O)C(F)(F)F
: