Target
Neutrophil elastase
Ligand
BDBM50005157
Substrate
Meas. Tech.
ChEBML_63659
IC50
>5000±n/a nM
Citation
 Skiles, JWFuchs, VMiao, CSorcek, RGrozinger, KGMauldin, SCVitous, JMui, PWJacober, SChow, G Inhibition of human leukocyte elastase (HLE) by N-substituted peptidyl trifluoromethyl ketones. J Med Chem 35:641-62 (1992)  
Target
Name:
Neutrophil elastase
Synonyms:
Bone marrow serine protease Coagulation factor X ELANE Elastase HLE Leukocyte elastase Medullasin Neutrophil elastase (HNE) PMN elastase Trypsin
Type:
Enzyme
Mol. Mass.:
28532.38
Organism:
Homo sapiens (Human)
Description:
P08246
Residue:
267
  
Inhibitor
Name:
BDBM50005157
Synonyms:
(1-{Indan-2-yl-[2-(3,3,3-trifluoro-1-isopropyl-2-oxo-propylamino)-ethyl]-carbamoyl}-2-methyl-propyl)-carbamic acid tert-butyl ester | CHEMBL160948
Type:
Small organic molecule
Emp. Form.:
C27H40F3N3O4
Mol. Mass.:
527.6194
SMILES:
CC(C)C(NCCN(C1Cc2ccccc2C1)C(=O)C(NC(=O)OC(C)(C)C)C(C)C)C(=O)C(F)(F)F
: