Target
Neutrophil elastase
Ligand
BDBM50005158
Substrate
Meas. Tech.
ChEBML_63659
IC50
507±n/a nM
Citation
 Skiles, JWFuchs, VMiao, CSorcek, RGrozinger, KGMauldin, SCVitous, JMui, PWJacober, SChow, G Inhibition of human leukocyte elastase (HLE) by N-substituted peptidyl trifluoromethyl ketones. J Med Chem 35:641-62 (1992)  
Target
Name:
Neutrophil elastase
Synonyms:
Bone marrow serine protease Coagulation factor X ELANE Elastase HLE Leukocyte elastase Medullasin Neutrophil elastase (HNE) PMN elastase Trypsin
Type:
Enzyme
Mol. Mass.:
28532.38
Organism:
Homo sapiens (Human)
Description:
P08246
Residue:
267
  
Inhibitor
Name:
BDBM50005158
Synonyms:
4-{(2-Benzyloxycarbonylamino-3-methyl-butyryl)-[(3,3,3-trifluoro-1-isopropyl-2-oxo-propylcarbamoyl)-methyl]-amino}-piperidine-1-carboxylic acid ethyl ester | CHEMBL351784
Type:
Small organic molecule
Emp. Form.:
C29H41F3N4O7
Mol. Mass.:
614.6536
SMILES:
CCOC(=O)N1CCC(CC1)N(CC(=O)NC(C(C)C)C(=O)C(F)(F)F)C(=O)C(NC(=O)OCc1ccccc1)C(C)C
: