Target
Neutrophil elastase
Ligand
BDBM50005165
Substrate
Meas. Tech.
ChEBML_63659
IC50
>5000±n/a nM
Citation
 Skiles, JWFuchs, VMiao, CSorcek, RGrozinger, KGMauldin, SCVitous, JMui, PWJacober, SChow, G Inhibition of human leukocyte elastase (HLE) by N-substituted peptidyl trifluoromethyl ketones. J Med Chem 35:641-62 (1992)  
Target
Name:
Neutrophil elastase
Synonyms:
Bone marrow serine protease Coagulation factor X ELANE Elastase HLE Leukocyte elastase Medullasin Neutrophil elastase (HNE) PMN elastase Trypsin
Type:
Enzyme
Mol. Mass.:
28532.38
Organism:
Homo sapiens (Human)
Description:
P08246
Residue:
267
  
Inhibitor
Name:
BDBM50005165
Synonyms:
CHEMBL345792 | [1-(Indan-2-yl-{[2-methyl-1-(4-trifluoromethyl-benzoyl)-propylcarbamoyl]-methyl}-carbamoyl)-2-methyl-propyl]-carbamic acid benzyl ester
Type:
Small organic molecule
Emp. Form.:
C36H40F3N3O5
Mol. Mass.:
651.7151
SMILES:
CC(C)C(NC(=O)OCc1ccccc1)C(=O)N(CC(=O)N[C@@H](C(C)C)C(=O)c1ccc(cc1)C(F)(F)F)C1Cc2ccccc2C1
: