Target
Neutrophil elastase
Ligand
BDBM50005168
Substrate
Meas. Tech.
ChEBML_63659
IC50
149±n/a nM
Citation
 Skiles, JWFuchs, VMiao, CSorcek, RGrozinger, KGMauldin, SCVitous, JMui, PWJacober, SChow, G Inhibition of human leukocyte elastase (HLE) by N-substituted peptidyl trifluoromethyl ketones. J Med Chem 35:641-62 (1992)  
Target
Name:
Neutrophil elastase
Synonyms:
Bone marrow serine protease Coagulation factor X ELANE Elastase HLE Leukocyte elastase Medullasin Neutrophil elastase (HNE) PMN elastase Trypsin
Type:
Enzyme
Mol. Mass.:
28532.38
Organism:
Homo sapiens (Human)
Description:
P08246
Residue:
267
  
Inhibitor
Name:
BDBM50005168
Synonyms:
4-(4-Bromo-benzenesulfonylaminocarbonyl)-N-(1-{indan-2-yl-[(3,3,3-trifluoro-1-isopropyl-2-oxo-propylcarbamoyl)-methyl]-carbamoyl}-2-methyl-propyl)-benzamide | CHEMBL160256
Type:
Small organic molecule
Emp. Form.:
C36H38BrF3N4O7S
Mol. Mass.:
807.674
SMILES:
CC(C)C(NC(=O)c1ccc(cc1)C(=O)NS(=O)(=O)c1ccc(Br)cc1)C(=O)N(CC(=O)NC(C(C)C)C(=O)C(F)(F)F)C1Cc2ccccc2C1
: