Target
Delta-type opioid receptor
Ligand
BDBM50000335
Substrate
Meas. Tech.
ChEBML_147061
Ki
1.8±n/a nM
Citation
 Hansen, DWStapelfeld, ASavage, MAReichman, MHammond, DLHaaseth, RCMosberg, HI Systemic analgesic activity and delta-opioid selectivity in [2,6-dimethyl-Tyr1,D-Pen2,D-Pen5]enkephalin. J Med Chem 35:684-7 (1992)  
Target
Name:
Delta-type opioid receptor
Synonyms:
Cytochrome P450 3A4 Delta opioid receptor Delta-type opioid receptor (DOR) OPRD_RAT Opioid receptor Opioid receptors; mu & delta Ror-a | Voltage-gated potassium channel
Type:
G Protein-Coupled Receptor (GPCR)
Mol. Mass.:
40465.04
Organism:
Rattus norvegicus (rat)
Description:
Competition binding assays were using CHO-K1 cell membranes expressing the opioid receptor.
Residue:
372
  
Inhibitor
Name:
BDBM50000335
Synonyms:
13-[2-Amino-3-(4-hydroxy-2,6-dimethyl-phenyl)-propionylamino]-7-benzyl-3,3,14,14-tetramethyl-6,9,12-trioxo-1,2-dithia-5,8,11-triaza-cyclotetradecane-4-carboxylic acid | CHEMBL159793
Type:
Small organic molecule
Emp. Form.:
C32H43N5O7S2
Mol. Mass.:
673.843
SMILES:
Cc1cc(O)cc(C)c1C[C@H](N)C(=O)N[C@@H]1C(=O)NCC(=O)N[C@H](Cc2ccccc2)C(=O)N[C@H](C(O)=O)C(C)(C)SSC1(C)C
: