Target
Amine oxidase [flavin-containing] B
Ligand
BDBM50368566
Substrate
Meas. Tech.
ChEBML_123740
Ki
12500000±n/a nM
Citation
 Ding, ZSilverman, RB 5-(Aminomethyl)-3-aryldihydrofuran-2(3H)-ones, a new class of monoamine oxidase-B inactivators. J Med Chem 35:885-9 (1992)  
Target
Name:
Amine oxidase [flavin-containing] B
Synonyms:
AOFB_BOVIN MAO-B Monoamine Oxidase Type B (MAO-B) Monoamine oxidase B | Monoamine oxidase type B
Type:
PROTEIN
Mol. Mass.:
58428.94
Organism:
Bos taurus
Description:
ChEMBL_1501478
Residue:
520
  
Inhibitor
Name:
BDBM50368566
Synonyms:
CHEMBL1203213
Type:
Small organic molecule
Emp. Form.:
C11H14N2O3
Mol. Mass.:
222.2405
SMILES:
COc1ccc(cc1)N1CC(CN)OC1=O
: