Target
Aminopeptidase B
Ligand
BDBM50001949
Substrate
Meas. Tech.
ChEBML_35343
IC50
400000±n/a nM
Citation
 Herranz, RVinuesa, SPérez, CGarcía-López, MTLópez, Ede Ceballos, MLDel Río, J Analgesic dipeptide derivatives. 7. 3,7-Diamino-2-hydroxyheptanoic acid (DAHHA) containing dipeptide analogues of the analgesic compound H-Lys-Trp(Nps)-OMe. J Med Chem 35:889-95 (1992)  
Target
Name:
Aminopeptidase B
Synonyms:
AMPB_RAT Arginine aminopeptidase Cytosol aminopeptidase IV | Rnpep
Type:
PROTEIN
Mol. Mass.:
72609.93
Organism:
Rattus norvegicus
Description:
ChEMBL_1344423
Residue:
650
  
Inhibitor
Name:
BDBM50001949
Synonyms:
2-(2,6-Diamino-hexanoylamino)-3-[2-(2-nitro-phenylsulfanyl)-1H-indol-3-yl]-propionic acid methyl ester | CHEMBL178014
Type:
Small organic molecule
Emp. Form.:
C24H29N5O5S
Mol. Mass.:
499.583
SMILES:
COC(=O)[C@H](Cc1c(Sc2ccccc2[N+]([O-])=O)[nH]c2ccccc12)NC(=O)[C@@H](N)CCCCN
: