Target
Aminopeptidase B
Ligand
BDBM50001947
Substrate
Meas. Tech.
ChEMBL_35342 (CHEMBL646060)
IC50
486000±n/a nM
Citation
 Herranz, RVinuesa, SPérez, CGarcía-López, MTLópez, Ede Ceballos, MLDel Río, J Analgesic dipeptide derivatives. 7. 3,7-Diamino-2-hydroxyheptanoic acid (DAHHA) containing dipeptide analogues of the analgesic compound H-Lys-Trp(Nps)-OMe. J Med Chem 35:889-95 (1992)  
Target
Name:
Aminopeptidase B
Synonyms:
AMPB_RAT Arginine aminopeptidase Cytosol aminopeptidase IV | Rnpep
Type:
PROTEIN
Mol. Mass.:
72609.93
Organism:
Rattus norvegicus
Description:
ChEMBL_1344423
Residue:
650
  
Inhibitor
Name:
BDBM50001947
Synonyms:
2-(3,7-Diamino-2-hydroxy-heptanoylamino)-3-[2-(2-nitro-phenylsulfanyl)-1H-indol-3-yl]-propionic acid methyl ester2-(3,7-diamino-2-hydroxy-heptanoylamino)-3-[2-(2-nitro-phenylsulfanyl)-1H-indol-3-yl]-propionic acid methyl ester; | CHEMBL171497
Type:
Small organic molecule
Emp. Form.:
C25H31N5O6S
Mol. Mass.:
529.609
SMILES:
COC(=O)[C@@H](Cc1c(Sc2ccccc2[N+]([O-])=O)[nH]c2ccccc12)NC(=O)C(O)[C@H](N)CCCCN
: