Target
Aminopeptidase N
Ligand
BDBM50368567
Substrate
Meas. Tech.
ChEBML_35366
IC50
>1000000±n/a nM
Citation
 Herranz, RVinuesa, SPérez, CGarcía-López, MTLópez, Ede Ceballos, MLDel Río, J Analgesic dipeptide derivatives. 7. 3,7-Diamino-2-hydroxyheptanoic acid (DAHHA) containing dipeptide analogues of the analgesic compound H-Lys-Trp(Nps)-OMe. J Med Chem 35:889-95 (1992)  
Target
Name:
Aminopeptidase N
Synonyms:
AMPN_RAT | Anpep
Type:
PROTEIN
Mol. Mass.:
109431.53
Organism:
Rattus norvegicus
Description:
ChEMBL_35366
Residue:
965
  
Inhibitor
Name:
BDBM50368567
Synonyms:
CHEMBL1794905
Type:
Small organic molecule
Emp. Form.:
C14H29N3O4
Mol. Mass.:
303.3978
SMILES:
COC(=O)[C@H](CC(C)C)NC(=O)[C@H](O)[C@@H](N)CCCCN
: