Target
Adenosine receptor A1
Ligand
BDBM50005368
Substrate
Meas. Tech.
ChEBML_29292
Ki
140±n/a nM
Citation
 Shimada, JSuzuki, FNonaka, HIshii, A 8-Polycycloalkyl-1,3-dipropylxanthines as potent and selective antagonists for A1-adenosine receptors. J Med Chem 35:924-30 (1992)  
Target
Name:
Adenosine receptor A1
Synonyms:
A1 adenosine receptor ADENOSINE A1 ADENOSINE A1 low Adenosine A1 receptor | Adenosine Receptor A1
Type:
Enzyme Catalytic Domain
Mol. Mass.:
36501.39
Organism:
GUINEA PIG
Description:
ADENOSINE A1 ADORA1 GUINEA PIG::P47745
Residue:
326
  
Inhibitor
Name:
BDBM50005368
Synonyms:
8-(1-Methyl-1H-pyrrol-2-yl)-1,3-dipropyl-3,7-dihydro-purine-2,6-dione | CHEMBL367884
Type:
Small organic molecule
Emp. Form.:
C16H21N5O2
Mol. Mass.:
315.3702
SMILES:
CCCn1c2nc([nH]c2c(=O)n(CCC)c1=O)-c1cccn1C
: