Target
Adenosine receptor A2a/A2b
Ligand
BDBM50004578
Substrate
Meas. Tech.
ChEMBL_30562 (CHEMBL649874)
Ki
290±n/a nM
Citation
 Shimada, JSuzuki, FNonaka, HIshii, A 8-Polycycloalkyl-1,3-dipropylxanthines as potent and selective antagonists for A1-adenosine receptors. J Med Chem 35:924-30 (1992)  
Target
Name:
Adenosine receptor A2a/A2b
Synonyms:
Adenosine A2 receptor
Type:
Mol. Mass.:
Description:
ASSAY_ID of ChEMBL is 30560
Components:
This complex has 2 components.
Component 1
Name:
Adenosine receptor A2b
Synonyms:
AA2BR_RAT Adora2b
Type:
PROTEIN
Mol. Mass.:
36378.84
Organism:
Rattus norvegicus
Description:
ChEMBL_32934
Residue:
332
  
Component 2
Name:
Adenosine receptor A2a
Synonyms:
AA2AR_RAT Adenosine A2 receptor Adenosine Receptors A2a (A2a) Adenosine receptors A2a Rat striatal adenosine A2a receptor
Type:
G Protein-Coupled Receptor (GPCR)
Mol. Mass.:
45015.65
Organism:
Rattus norvegicus (rat)
Description:
Rat A2A receptors expressed in CHO cells.
Residue:
410
  
Inhibitor
Name:
BDBM50004578
Synonyms:
8-Bicyclo[2.2.1]hept-2-yl-1,3-dipropyl-3,7-dihydro-purine-2,6-dione | CHEMBL415321
Type:
Small organic molecule
Emp. Form.:
C18H26N4O2
Mol. Mass.:
330.4246
SMILES:
CCCn1c2nc([nH]c2c(=O)n(CCC)c1=O)C1CC2CCC1C2
: