Target
Adenosine receptor A2a/A2b
Ligand
BDBM50004593
Substrate
Meas. Tech.
ChEMBL_30692 (CHEMBL646320)
Ki
>100000±n/a nM
Citation
 Shimada, JSuzuki, FNonaka, HIshii, A 8-Polycycloalkyl-1,3-dipropylxanthines as potent and selective antagonists for A1-adenosine receptors. J Med Chem 35:924-30 (1992)  
Target
Name:
Adenosine receptor A2a/A2b
Synonyms:
Adenosine A2 receptor
Type:
Mol. Mass.:
Description:
ASSAY_ID of ChEMBL is 30560
Components:
This complex has 2 components.
Component 1
Name:
Adenosine receptor A2b
Synonyms:
AA2BR_RAT Adora2b
Type:
PROTEIN
Mol. Mass.:
36378.84
Organism:
Rattus norvegicus
Description:
ChEMBL_32934
Residue:
332
  
Component 2
Name:
Adenosine receptor A2a
Synonyms:
AA2AR_RAT Adenosine A2 receptor Adenosine Receptors A2a (A2a) Adenosine receptors A2a Rat striatal adenosine A2a receptor
Type:
G Protein-Coupled Receptor (GPCR)
Mol. Mass.:
45015.65
Organism:
Rattus norvegicus (rat)
Description:
Rat A2A receptors expressed in CHO cells.
Residue:
410
  
Inhibitor
Name:
BDBM50004593
Synonyms:
1,3-Dipropyl-8-(2,2,5,5-tetramethyl-cyclopentyl)-3,7-dihydro-purine-2,6-dione | CHEMBL106548
Type:
Small organic molecule
Emp. Form.:
C20H32N4O2
Mol. Mass.:
360.4937
SMILES:
CCCn1c2nc([nH]c2c(=O)n(CCC)c1=O)C1C(C)(C)CCC1(C)C
: