Target
D(2) dopamine receptor
Ligand
BDBM50368585
Substrate
Meas. Tech.
ChEMBL_62421 (CHEMBL674825)
Ki
>1000±n/a nM
Citation
 Moon, MWMorris, JKHeier, RFChidester, CGHoffmann, WEPiercey, MFAlthaus, JSVon Voigtlander, PFEvans, DLFigur, LM Dopaminergic and serotonergic activities of imidazoquinolinones and related compounds. J Med Chem 35:1076-92 (1992)  
Target
Name:
D(2) dopamine receptor
Synonyms:
DOPAMINE D2 DOPAMINE D2 Short Dopamine D2 receptor Drd2
Type:
G Protein-Coupled Receptor (GPCR)
Mol. Mass.:
50931.60
Organism:
Rattus norvegicus (rat)
Description:
P61169
Residue:
444
  
Inhibitor
Name:
BDBM50368585
Synonyms:
CHEMBL1202408
Type:
Small organic molecule
Emp. Form.:
C17H25N3
Mol. Mass.:
271.4005
SMILES:
CCCN(CCC)C1Cc2cccc3nc(C)n(C1)c23
: