Target
D(2) dopamine receptor
Ligand
BDBM50001966
Substrate
Meas. Tech.
ChEMBL_62419 (CHEMBL674823)
Ki
>1000±n/a nM
Citation
 Moon, MWMorris, JKHeier, RFChidester, CGHoffmann, WEPiercey, MFAlthaus, JSVon Voigtlander, PFEvans, DLFigur, LM Dopaminergic and serotonergic activities of imidazoquinolinones and related compounds. J Med Chem 35:1076-92 (1992)  
Target
Name:
D(2) dopamine receptor
Synonyms:
DOPAMINE D2 DOPAMINE D2 Short Dopamine D2 receptor Drd2
Type:
G Protein-Coupled Receptor (GPCR)
Mol. Mass.:
50931.60
Organism:
Rattus norvegicus (rat)
Description:
P61169
Residue:
444
  
Inhibitor
Name:
BDBM50001966
Synonyms:
5-Dipropylamino-5,6-dihydro-4H-pyrrolo[3,2,1-ij]quinoline-1,2-dione | CHEMBL274419
Type:
Small organic molecule
Emp. Form.:
C17H22N2O2
Mol. Mass.:
286.3688
SMILES:
CCCN(CCC)C1CN2C(=O)C(=O)c3cccc(C1)c23
: