Target
D(2) dopamine receptor
Ligand
BDBM50001976
Substrate
Meas. Tech.
ChEMBL_62419 (CHEMBL674823)
Ki
1082±n/a nM
Citation
 Moon, MWMorris, JKHeier, RFChidester, CGHoffmann, WEPiercey, MFAlthaus, JSVon Voigtlander, PFEvans, DLFigur, LM Dopaminergic and serotonergic activities of imidazoquinolinones and related compounds. J Med Chem 35:1076-92 (1992)  
Target
Name:
D(2) dopamine receptor
Synonyms:
DOPAMINE D2 DOPAMINE D2 Short Dopamine D2 receptor Drd2
Type:
G Protein-Coupled Receptor (GPCR)
Mol. Mass.:
50931.60
Organism:
Rattus norvegicus (rat)
Description:
P61169
Residue:
444
  
Inhibitor
Name:
BDBM50001976
Synonyms:
5-Dipropylamino-5,6-dihydro-1H,4H-pyrrolo[3,2,1-ij]quinolin-2-one | CHEMBL11896
Type:
Small organic molecule
Emp. Form.:
C17H24N2O
Mol. Mass.:
272.3853
SMILES:
CCCN(CCC)C1CN2C(=O)Cc3cccc(C1)c23
: